Piperidine, 1-(1-butenyl)-

Gas phase ion energetics data

Data compiled as indicated in comments:
LLK - Sharon G. Lias, Rhoda D. Levin, and Sherif A. Kafafi

Ionization energy determinations

IE (eV) Method Reference Comment
≤7.46PEMuller, Previdoli, et al., 1981Vertical value; LLK

References

Muller, Previdoli, et al., 1981
Muller, K.; Previdoli, F.; Desilvestro, H., 246. Enamines. II. A theoretical and photoelectron spectroscopic study of the molecular and electronic structure of aliphatic enamines, Helv. Chim. Acta, 1981, 64, 2497. [all data]