3H-1,4-Benzodiazepin-2-one, 1,2-dihydro-5-methyl-

Gas phase ion energetics data

Data compiled by: Sharon G. Lias and Joel F. Liebman

Ionization energy determinations

IE (eV) Method Reference
7.8PEAndronati, Khvostenko, et al., 1989

References

Andronati, Khvostenko, et al., 1989
Andronati, S.A.; Khvostenko, V.I.; Khvostenko, O.G.; Fal'ko, V.S.; Zykov, B.G.; Prokopenko, I.A.; Yavorskii, A.S.; Lukin, V.G., Conformational lability of 1,4-benzdiazepin-2-ones, Dokl. Phys. Chem., 1989, 305, 77. [all data]