2-Methyl-2-adamantanol

Phase change data

Data compiled by: William E. Acree, Jr., James S. Chickos

Quantity Value Units Method Reference Comment
Δsub91.3 ± 0.8kJ/molMECharapennikau, Blokhin, et al., 2003Based on data from 298. - 334. K.
Δsub91.4 ± 0.3kJ/molCCharapennikau, Blokhin, et al., 2003

References

Charapennikau, Blokhin, et al., 2003
Charapennikau, M.B.; Blokhin, A.V.; Kabo, G.J.; Sevruk, V.M.; Krasulin, A.P., Thermodynamic properties of three adamantanols in the ideal gas state, Thermochimica Acta, 2003, 405, 1, 85-91, https://doi.org/10.1016/S0040-6031(03)00126-6 . [all data]