1-Methylpentyl cyclopropane

Condensed phase thermochemistry data

Data compiled by: Hussein Y. Afeefy, Joel F. Liebman, and Stephen E. Stein

Quantity Value Units Method Reference Comment
Δcliquid-5648.kJ/molCcbSlabey and Wise, 1952Corresponding Δfliquid = -464. kJ/mol (simple calculation by NIST; no Washburn corrections)

References

Slabey and Wise, 1952
Slabey, V.A.; Wise, P.H., Hydrogenation of 2-cyclopropyl-1- and -2-alkenes. Isolation and Purification of 2-cyclopropylalkanes, J. Am. Chem. Soc., 1952, 74, 3887-3889. [all data]