Cyclopropane, (1,2-dimethylpropyl)-

Phase change data

Data compiled by: Thermodynamics Research Center, NIST Boulder Laboratories, Chris Muzny director

Quantity Value Units Method Reference Comment
Tboil388.64KN/ASlabey, 1952Uncertainty assigned by TRC = 0.5 K

In addition to the Thermodynamics Research Center (TRC) data available from this site, much more physical and chemical property data is available from the following TRC products:

References

Slabey, 1952
Slabey, V.A., Synthesis and purification of 2-cyclopropyl-3-methyl-1-butene and 2-cyclopropyl-3-methylbutane, J. Am. Chem. Soc., 1952, 74, 4963-4. [all data]