1-Methoxy-5-methyl-3-methylenecyclohexene

Reaction thermochemistry data

Data compiled by: Hussein Y. Afeefy, Joel F. Liebman, and Stephen E. Stein

Individual Reactions

1-Methoxy-5-methyl-3-methylenecyclohexene = 1,3-Cyclohexadiene, 1-methoxy-3, 5-dimethyl-

By formula: C9H14O = C9H14O

Quantity Value Units Method Reference Comment
Δr4.6 ± 0.2kJ/molEqkTaskinen and Nummelin, 1986liquid phase; solvent: Cyclohexane; GLC

References

Taskinen and Nummelin, 1986
Taskinen, E.; Nummelin, K., Thermodynamics of vinyl ethers. 31. Isomer equilibria in some six- and seven-membered cyclic dienes, J. Org. Chem., 1986, 50, 4844-4847. [all data]