Pentanoic acid, 4-oxo-, phenylmethyl ester

Van Den Dool and Kratz RI, polar column, temperature ramp

View large format table.

Column type Active phase I Reference Comment
CapillaryDB-Wax2526.Shu and Lawrence, 199530. m/0.32 mm/0.25 μm, 6. K/min; Tstart: 50. C; Tend: 190. C

References

Shu and Lawrence, 1995
Shu, C.-K.; Lawrence, B.M., Formation of 4-alkoxy-γ-valerolactones from levulinic acid and alcohols during storage at room temperature, J. Agric. Food Chem., 1995, 43, 3, 782-784, https://doi.org/10.1021/jf00051a041 . [all data]