3H-Diazirine, 3,3-difluoro-

Gas phase ion energetics data

Data compiled by: Sharon G. Lias, Rhoda D. Levin, and Sherif A. Kafafi

Ionization energy determinations

IE (eV) Method Reference
11.2PERobin, Brundle, et al., 1972

References

Robin, Brundle, et al., 1972
Robin, M.B.; Brundle, C.R.; Kuebler, N.A.; Ellison, G.B.; Wiberg, K.B., Photoelectron spectra of small rings. IV. The unsaturated three-membered rings, J. Chem. Phys., 1972, 57, 1758. [all data]