Rhodium, bis(η2-ethene)(1,1,1-trifluoro-2,4-pentanedionato-O,O')-

Gas phase ion energetics data

Data compiled by: Sharon G. Lias, Rhoda D. Levin, and Sherif A. Kafafi

Ionization energy determinations

IE (eV) Method Reference Comment
7.96PEVan Dam, Terpstra, et al., 1980Vertical value

References

Van Dam, Terpstra, et al., 1980
Van Dam, H.; Terpstra, A.; Stufkens, D.J.; Oskam, A., UV photoelectron spectroscopic studies of the metal-olefin bond. 2. Bonding in (β-diketonato)rhodium(I) and -iridium(I) carbonyl and olefin complexes, Inorg. Chem., 1980, 19, 3448. [all data]