Boranediamine, pentamethyl-

Gas phase ion energetics data

Data compiled as indicated in comments:
LBLHLM - Sharon G. Lias, John E. Bartmess, Joel F. Liebman, John L. Holmes, Rhoda D. Levin, and W. Gary Mallard
LLK - Sharon G. Lias, Rhoda D. Levin, and Sherif A. Kafafi

Ionization energy determinations

IE (eV) Method Reference Comment
7.63PEBock and Fuss, 1971LLK
7.63PENoth and Prigge, 1986Vertical value; LBLHLM

References

Bock and Fuss, 1971
Bock, H.; Fuss, W., Ionisierungsenergien und geometrie von aminoboranen, Chem. Ber., 1971, 104, 1687. [all data]

Noth and Prigge, 1986
Noth, H.; Prigge, H., Kernresonanz- und He(I)-photoelektronenspektroskopische untersuchung an diisopropyl- und di-tert-butylboranen, Chem. Ber., 1986, 119, 338. [all data]