2-Ethylhexyl methacrylate

Condensed phase thermochemistry data

Data compiled by: Eugene S. Domalski and Elizabeth D. Hearing

Constant pressure heat capacity of liquid

Cp,liquid (J/mol*K) Temperature (K) Reference Comment
386.0298.15Karabaev, Abduzhaminov, et al., 1985T = 230 to 350 K. Cp (J/kg*K) = 1261.8 + 2.2971 T. Cp data calculated from equation.
386.2298.15Karabaev, Saidov, et al., 1985T = 90 to 350 K. Cp(c) = 199.31 + 5.22T J/kg*K (95 to 205 K); Cp(liq) = 1261.84 + 2.30T J/kg*K (230.3 to 350 K). Cp data calculated from equation.

Kovats' RI, non-polar column, isothermal

View large format table.

Column type Active phase Temperature (C) I Reference Comment
CapillaryOV-101170.1295.Horna, Táborský, et al., 1985N2; Column length: 19. m; Column diameter: 0.28 mm
CapillaryOV-101200.1297.Horna, Táborský, et al., 1985N2; Column length: 19. m; Column diameter: 0.28 mm

Kovats' RI, polar column, isothermal

View large format table.

Column type Active phase Temperature (C) I Reference Comment
CapillarySP-1000170.1540.Horna, Táborský, et al., 1985N2; Column length: 46. m; Column diameter: 0.23 mm
CapillarySP-1000200.1546.Horna, Táborský, et al., 1985N2; Column length: 46. m; Column diameter: 0.23 mm

Phase change data

Data compiled as indicated in comments:
BS - Robert L. Brown and Stephen E. Stein
DH - Eugene S. Domalski and Elizabeth D. Hearing

Quantity Value Units Method Reference Comment
Tfus230.3KN/AKarabaev, Abduzhaminov, et al., 1985DH
Tfus230.3KN/AKarabaev, Saidov, et al., 1985DH

Reduced pressure boiling point

Tboil (K) Pressure (atm) Reference Comment
393.20.024Aldrich Chemical Company Inc., 1990BS

Enthalpy of fusion

ΔfusH (kcal/mol) Temperature (K) Reference Comment
5.7565230.3Karabaev, Abduzhaminov, et al., 1985, 2DH

Entropy of fusion

ΔfusS (cal/mol*K) Temperature (K) Reference Comment
25.00230.3Karabaev, Abduzhaminov, et al., 1985, 2DH

References

Karabaev, Abduzhaminov, et al., 1985
Karabaev, M.; Abduzhaminov, T.P.; Saidov, A.A.; Igamberdyev, Kh.T., Thermophysical properties of liquid methacrylic acid and its simple esters, Izv. Akad. Nauk Uzb. SSR, Ser. Fiz.-Mat. Nauk, 1985, (4), 71-74. [all data]

Karabaev, Saidov, et al., 1985
Karabaev, M.; Saidov, A.A.; Abduzhaminov, T.P.; Kenisarin, M.M., Heat capacity and molecular kinetic processes of condensed phase acrylates and methacrylates, Izv. Akad. Nauk UzSSR, Ser. Fiz.-Math., 1985, (6), 51-54. [all data]