Carbamodithioic acid, diethyl-, methyl ester

Condensed phase thermochemistry data

Data compiled by: Hussein Y. Afeefy, Joel F. Liebman, and Stephen E. Stein

Quantity Value Units Method Reference Comment
Δfliquid-104.kJ/molCcbDelephine, 1903
Quantity Value Units Method Reference Comment
Δcliquid-5320.8kJ/molCcbDelephine, 1903

References

Delephine, 1903
Delephine, M., Chalcurs de formation de quelques composes sulfuris et azoles, Compt. Rend., 1903, 136, 451-453. [all data]