2,4-Imidazolidinedione, 3-methyl-

Gas phase ion energetics data

Data compiled by: Sharon G. Lias and Joel F. Liebman

Ionization energy determinations

IE (eV) Method Reference Comment
9.7PEVondrak and Cauletti, 1988
9.87 ± 0.05PEVondrak and Cauletti, 1988Vertical value

References

Vondrak and Cauletti, 1988
Vondrak, T.; Cauletti, C., ELectronic structure of hydantoin studied by He I photoelectron spectroscopy and MNDO quantum-chemical calculations, Spectrochim. Acta A:, 1988, 44, 289. [all data]