1,1-Diethoxy-1-(ethylthio)ethane

Gas phase thermochemistry data

Data compiled by: Hussein Y. Afeefy, Joel F. Liebman, and Stephen E. Stein

Quantity Value Units Method Reference Comment
Δfgas-454. ± 17.kJ/molEqkGuthrie, 1978

References

Guthrie, 1978
Guthrie, J.P., Hydration of thioesters. Evaluation of the free-energy changes for the addition of water to some thioesters, rate-equilibrium correlations over very wide ranges in equilibrium constants, and a new mechanistic criterion, J. Am. Chem. Soc., 1978, 100, 5892-5904. [all data]