Cyclobutane,3-ethynyl-1,1-dimethyl

Gas phase ion energetics data

Data compiled by: Sharon G. Lias, Rhoda D. Levin, and Sherif A. Kafafi

Ionization energy determinations

IE (eV) Method Reference Comment
9.78PEBruckmann and Klessinger, 1978Vertical value

References

Bruckmann and Klessinger, 1978
Bruckmann, P.; Klessinger, M., Konjugative Wechselwirkungen des Cyclobutans, Chem. Ber., 1978, 111, 944. [all data]