N-Methyl-2,3-5,6-dibenzazalene

Phase change data

Data compiled as indicated in comments:
AC - William E. Acree, Jr., James S. Chickos
ALS - Hussein Y. Afeefy, Joel F. Liebman, and Stephen E. Stein

Quantity Value Units Method Reference Comment
Δsub132.0kJ/molVGeiseler, Quitzsch, et al., 1966ALS

Enthalpy of vaporization

ΔvapH (kJ/mol) Temperature (K) Method Reference Comment
122.2381.AGeiseler, Quitzsch, et al., 1966Based on data from 375. - 388. K. See also Cox and Pilcher, 1970.; AC

Condensed phase thermochemistry data

Data compiled by: Hussein Y. Afeefy, Joel F. Liebman, and Stephen E. Stein

Quantity Value Units Method Reference Comment
Δcsolid-8752.9kJ/molCcbGeiseler, Quitzsch, et al., 1966

References

Geiseler, Quitzsch, et al., 1966
Geiseler, V.G.; Quitzsch, K.; Rauh, H.J.; Schaffernicht, H.; Walther, H.J., Bildungsenthalpien und Mesomerieenergien von π-Bindungssystemen 1. Mitteilung: Bildungsenthalpien und Mesomerieenergien einiger mehrkerniger Aromaten und verschiedener Pseudoazulene, Ber. Bunsen-Ges. Phys. Chem., 1966, 70, 551-556. [all data]

Cox and Pilcher, 1970
Cox, J.D.; Pilcher, G., Thermochemistry of Organic and Organometallic Compounds, Academic Press Inc., London, 1970, 643. [all data]