Pencycuron

Normal alkane RI, non-polar column, custom temperature program

View large format table.

Column type Active phase I Reference Comment
CapillaryHP-51690.Kawara, Asada, et al., 200530. m/0.25 mm/0.25 μm; Program: 50 0C (1 min) 20 0C/min -> 150 0C 10 0C/min -> 280 0C

References

Kawara, Asada, et al., 2005
Kawara, K.; Asada, T.; Oikawa, K.; Tanabe, A., Multiresidue determination of pesticides in sediments by ultrasonically assisted extraction and gas chromatography/mass spectrometry, J. AOAC International, 2005, 88, 5, 1440-1451. [all data]