Codeine-propionyl

Van Den Dool and Kratz RI, non-polar column, temperature ramp

View large format table.

Column type Active phase I Reference Comment
CapillaryHP-5MS2665.Melent'ev, 200430. m/0.25 mm/0.25 μm, He, 120. C @ 7. min, 20. K/min; Tend: 300. C

References

Melent'ev, 2004
Melent'ev, A.B., Gas chromatography-mass spectrometry determination of morphine and codeine in blood as their propionic esters, J. Anal. Chem. USSR (Engl. Transl.), 2004, 59, 6, 566-570. [all data]