lithium propionate

Condensed phase thermochemistry data

Data compiled by: Eugene S. Domalski and Elizabeth D. Hearing

Quantity Value Units Method Reference Comment
solid,1 bar143.17J/mol*KN/AFranzosini and Westrum, 1985
solid,1 bar175.9J/mol*KN/AFranzosini and Westrum, 1984

Constant pressure heat capacity of solid

Cp,solid (J/mol*K) Temperature (K) Reference Comment
130.29298.15Franzosini and Westrum, 1985T = 5 to 350 K.
143.8298.15Franzosini and Westrum, 1984T = 10 to 600 K.

References

Franzosini and Westrum, 1985
Franzosini, P.; Westrum, E.F., Recent investigations on the thermophysics of lithium soaps, 1985, Calorim. [all data]

Franzosini and Westrum, 1984
Franzosini, P.; Westrum, E.F., Jr., Thermophysics of metal alkanoates. III. Heat capacities and thermodynamic properties of lithium and potassium propanoates, J. Chem. Thermodynam., 1984, 16, 81-90. [all data]