5-Methyl-2-phenyl-hex-2-enenitrile

Condensed phase thermochemistry data

Data compiled by: Hussein Y. Afeefy, Joel F. Liebman, and Stephen E. Stein

Quantity Value Units Method Reference Comment
Δfsolid147.0kJ/molCcbCiocazanu and Zavolanu, 1997
Quantity Value Units Method Reference Comment
Δcsolid-7406.47kJ/molCcbCiocazanu and Zavolanu, 1997

References

Ciocazanu and Zavolanu, 1997
Ciocazanu, I.; Zavolanu, D., Structura si reactivitatea nitrililor, Rev. Chem. Intermed., 1997, 48, 121-123. [all data]