Methyl 10-oxo-8-decenoate

Normal alkane RI, non-polar column, temperature ramp

View large format table.

Column type Active phase I Reference Comment
CapillaryOV-1011592.Tressl, Bahri, et al., 19822. K/min; Column length: 50. m; Column diameter: 0.32 mm; Tstart: 100. C; Tend: 250. C

Normal alkane RI, polar column, temperature ramp

View large format table.

Column type Active phase I Reference Comment
CapillaryCarbowax 20M2190.Tressl, Bahri, et al., 19822. K/min; Column length: 50. m; Column diameter: 0.32 mm; Tstart: 70. C; Tend: 190. C

References

Tressl, Bahri, et al., 1982
Tressl, R.; Bahri, D.; Engel, K.-H., Formation of eight-carbon and ten-carbon components in mushrooms (Agaricus campestris), J. Agric. Food Chem., 1982, 30, 1, 89-93, https://doi.org/10.1021/jf00109a019 . [all data]