1-Butene, 1-(ethylthio)-3,3-dimethyl-, (Z)-

Reaction thermochemistry data

Data compiled by: Hussein Y. Afeefy, Joel F. Liebman, and Stephen E. Stein

Individual Reactions

(E) 1-Ethylthio-3,3-dimethyl-1-butene = 1-Butene, 1-(ethylthio)-3,3-dimethyl-, (Z)-

By formula: C8H16S = C8H16S

Quantity Value Units Method Reference Comment
Δr9.8 ± 0.7kJ/molEqkKimmelma and Toivo, 1996liquid phase; solvent: Dimethylsulfoxide

References

Kimmelma and Toivo, 1996
Kimmelma, R.; Toivo, A., Structure-stability relationships in unsaturated sulfur compounds. VIII. Thermodynamic of the geometric isomers of vinyl sulfides, sulfoxides and sulfones, Acta Chem. Scand., 1996, 50, 1064-1068. [all data]