t-Butyldifluoroamine

Phase change data

Data compiled by: Hussein Y. Afeefy, Joel F. Liebman, and Stephen E. Stein

Quantity Value Units Method Reference Comment
Δvap29. ± 0.8kJ/molVPepkin, Lebedev, et al., 1968

References

Pepkin, Lebedev, et al., 1968
Pepkin, V.I.; Lebedev, Yu.A.; Novoselov, N.P.; Kosyrev, Yu.M.; Fokin, A.V.; Apin, A.Ya., The carbon-nitrogen bond energy in tert-butyldifluoroamine, Bull. Acad. Sci. USSR, Div. Chem. Sci., 1968, 1074-1075, In original 1128. [all data]