L-Mannitol

Condensed phase thermochemistry data

Data compiled by: Hussein Y. Afeefy, Joel F. Liebman, and Stephen E. Stein

Quantity Value Units Method Reference Comment
Δcsolid-3037.kJ/molCcbBaer and Flehmig, 1969Corresponding Δfsolid = -1325. kJ/mol (simple calculation by NIST; no Washburn corrections)

References

Baer and Flehmig, 1969
Baer, E.; Flehmig, H.-H., Refutation of alleged differences in the energy contents of optical isomers, Can. J. Biochem., 1969, 47, 79-83. [all data]