2,3-Difluorophenol

Phase change data

Data compiled by: William E. Acree, Jr., James S. Chickos

Quantity Value Units Method Reference Comment
Δsub68.2 ± 1.5kJ/molCRibeiro da Silva and Lobo Ferreira, 2010

References

Ribeiro da Silva and Lobo Ferreira, 2010
Ribeiro da Silva, Manuel A.V.; Lobo Ferreira, Ana I.M.C., Calorimetric and computational thermochemical study of difluorophenol isomers, The Journal of Chemical Thermodynamics, 2010, 42, 2, 182-188, https://doi.org/10.1016/j.jct.2009.07.011 . [all data]