Lead(II) pentadecanoate

Condensed phase thermochemistry data

Data compiled by: Eugene S. Domalski and Elizabeth D. Hearing

Constant pressure heat capacity of solid

Cp,solid (J/mol*K) Temperature (K) Reference Comment
1430.380.Adeosun and Sime, 1978crystaline, II phase; Mean value, 376 to 380 K. Data only graphically for c,III.

References

Adeosun and Sime, 1978
Adeosun, S.O.; Sime, S.J., The properties of molten carboxylates: Part 7. Odd-even variations in melting and mesophase formation in the lead(II) carboxylates, J. Thermal Anal., 1978, 27, 319-327. [all data]