1-Eicosanol

Kovats' RI, non-polar column, isothermal

View large format table.

Column type Active phase Temperature (C) I Reference Comment
CapillaryOV-101200.2276.4Kittiratanapiboon, Jeyashoke, et al., 199815. m/0.25 mm/0.2 μm, N2
CapillaryCP Sil 5 CB240.2275.Hanai and Hong, 198930. m/0.25 mm/0.25 μm
CapillaryDB-1240.2276.Hanai and Hong, 198930. m/0.25 mm/0.25 μm

Kovats' RI, polar column, isothermal

View large format table.

Column type Active phase Temperature (C) I Reference Comment
CapillaryCP-Wax240.2755.Hanai and Hong, 198925. m/0.25 mm/0.22 μm

Van Den Dool and Kratz RI, non-polar column, temperature ramp

View large format table.

Column type Active phase I Reference Comment
CapillaryDB-52273.Nogueira, Bittrich, et al., 200130. m/0.25 mm/0.25 μm, H2, 3. K/min; Tstart: 60. C; Tend: 240. C
CapillaryDB-52292.Rostad and Pereira, 198630. m/0.26 mm/0.25 μm, He, 50. C @ 4. min, 6. K/min, 300. C @ 20. min

Normal alkane RI, non-polar column, temperature ramp

View large format table.

Column type Active phase I Reference Comment
CapillaryHP-5 MS2252.Xu, Han, et al., 201230. m/0.25 mm/0.25 μm, 60. C @ 2. min, 15. K/min, 300. C @ 10. min
CapillarySPB-12271.Lazarevic, Palic, et al., 201030. m/0.25 mm/0.25 μm, Helium, 50. C @ 3. min, 5. K/min, 250. C @ 15. min
CapillaryHP-52281.Radulovic, Dordevic, et al., 201030. m/0.25 mm/0.25 μm, Hydrogen, 5. K/min; Tstart: 70. C; Tend: 290. C
CapillaryHP-5 MS2290.Vedernikov and Roschin, 201030. m/0.25 mm/0.25 μm, Helium, 5. K/min, 280. C @ 10. min; Tstart: 150. C
CapillaryHP-5 MS2252.Xu, Han, et al., 200930. m/0.25 mm/0.25 μm, Helium, 60. C @ 2. min, 15. K/min, 300. C @ 10. min
CapillaryPE-52278.Pandey-Rai S., Mallavarapu G.R., et al., 200650. m/0.32 mm/0.25 μm, He, 100. C @ 1. min, 3. K/min; Tend: 280. C
CapillaryUltra-12267.Okumura, 199125. m/0.32 mm/0.25 μm, He, 3. K/min; Tstart: 80. C; Tend: 260. C
CapillarySE-302252.Yaacob, Abdullah, et al., 19894. K/min; Column length: 10. m; Column diameter: 0.25 mm; Tstart: 20. C; Tend: 200. C
CapillarySE-542296.Bestmann, Classen, et al., 1988N2, 60. C @ 2. min, 6. K/min; Column length: 25. m; Column diameter: 0.25 mm; Tend: 260. C

Normal alkane RI, non-polar column, custom temperature program

View large format table.

Column type Active phase I Reference Comment
CapillaryHP-5 MS2282.Vedernikov and Roschin, 201030. m/0.25 mm/0.25 μm, Helium; Program: not specified

Normal alkane RI, polar column, temperature ramp

View large format table.

Column type Active phase I Reference Comment
CapillaryTC-WAX FFS2717.Miyazawa, Maehara, et al., 2002He, 3. K/min; Column length: 60. m; Column diameter: 0.25 mm; Tstart: 60. C; Tend: 240. C

Lee's RI, non-polar column, temperature ramp

View large format table.

Column type Active phase I Reference Comment
CapillaryDB-5MS371.04Chen, Keeran, et al., 200230. m/0.25 mm/0.5 μm, 40. C @ 1. min, 10. K/min; Tend: 310. C
CapillaryDB-5MS374.80Chen, Keeran, et al., 200230. m/0.25 mm/0.5 μm, 40. C @ 1. min, 4. K/min; Tend: 310. C
CapillaryDB-5374.56Rostad and Pereira, 198630. m/0.26 mm/0.25 μm, He, 50. C @ 4. min, 6. K/min, 300. C @ 20. min

Phase change data

Data compiled as indicated in comments:
TRC - Thermodynamics Research Center, NIST Boulder Laboratories, Chris Muzny director
AC - William E. Acree, Jr., James S. Chickos
ALS - Hussein Y. Afeefy, Joel F. Liebman, and Stephen E. Stein

Quantity Value Units Method Reference Comment
Tfus338.KN/AKuchhal, Shukla, et al., 1979Crystal phase 1 phase; Uncertainty assigned by TRC = 0.25 K; TRC
Tfus338.3KN/ADavies and Kybett, 1965Uncertainty assigned by TRC = 0.8 K; TRC
Tfus339.2KN/AShulman, Formo, et al., 1961Uncertainty assigned by TRC = 2. K; TRC
Tfus344.7KN/AScholl and Morrison, 1954Uncertainty assigned by TRC = 2. K; TRC
Tfus338.5KN/ABecker and Strating, 1940Uncertainty assigned by TRC = 1.5 K; TRC
Quantity Value Units Method Reference Comment
Δvap125.9 ± 0.8kJ/molCGCNichols, Kweskin, et al., 2006AC
Quantity Value Units Method Reference Comment
Δsub218. ± 4.kJ/molVDavies and Kybett, 1965ALS
Δsub223. ± 3.8kJ/molN/ADavies and Kybett, 1965AC

Enthalpy of vaporization

ΔvapH (kJ/mol) Temperature (K) Method Reference Comment
83.5503.AStephenson and Malanowski, 1987Based on data from 488. - 653. K.; AC
83.4508.AStephenson and Malanowski, 1987Based on data from 493. - 648. K.; AC
118.9348.MEStephenson and Malanowski, 1987Based on data from 339. - 358. K. See also Davies and Kybett, 1965.; AC

Enthalpy of sublimation

ΔsubH (kJ/mol) Temperature (K) Method Reference Comment
218. ± 3.8332.MEDavies and Kybett, 1965Based on data from 327. - 341. K. See also Stephenson and Malanowski, 1987.; AC

Enthalpy of fusion

ΔfusH (kJ/mol) Temperature (K) Method Reference Comment
43.6336.6DSCVentol«65533», Calvet, et al., 2004AC
43.6336.6N/AVentolà, Ramírez, et al., 2002AC
73.72338.2N/Avan Miltenburg, Oonk, et al., 2001AC

In addition to the Thermodynamics Research Center (TRC) data available from this site, much more physical and chemical property data is available from the following TRC products:

References

Kittiratanapiboon, Jeyashoke, et al., 1998
Kittiratanapiboon, K.; Jeyashoke, N.; Krisnangkura, K., The relationship of Kováts retention indices and equivalent chain lengths of fatty acid methyl esters on a methyl silicone capillary column, J. Chromatogr. Sci., 1998, 36, 7, 361-364, https://doi.org/10.1093/chromsci/36.7.361 . [all data]

Hanai and Hong, 1989
Hanai, T.; Hong, C., Structure-retention correlation in CGC, J. Hi. Res. Chromatogr., 1989, 12, 5, 327-332, https://doi.org/10.1002/jhrc.1240120517 . [all data]

Nogueira, Bittrich, et al., 2001
Nogueira, P.C.L.; Bittrich, V.; Shepherd, G.J.; Lopes, A.V.; Marsaioli, A.J., The ecological and taxonomic importance of flower volatiles of Clusia species (Guttiferae), Phytochemistry, 2001, 56, 5, 443-452, https://doi.org/10.1016/S0031-9422(00)00213-2 . [all data]

Rostad and Pereira, 1986
Rostad, C.E.; Pereira, W.E., Kovats and Lee retention indices determined by gas chromatography/mass spectrometry for organic compounds of environmental interest, J. Hi. Res. Chromatogr. Chromatogr. Comm., 1986, 9, 6, 328-334, https://doi.org/10.1002/jhrc.1240090603 . [all data]

Xu, Han, et al., 2012
Xu, L.-L.; Han, T.; Wu, J.-Z.; Zhang, Q.-Y.; Zhang, H.; Huang, B.-K.; Rahman, K., Comparative research of chemical constituents, antifungal and antitumor properties of ether extracts of Panax ginseng and its endophytic fungus, 2012, retrieved from http://www.thefreelibrary.com/Comparative .... [all data]

Lazarevic, Palic, et al., 2010
Lazarevic, J.S.; Palic, R.V.M.; Radulovic, N.S.; Ristic, N.R.; Stojanovic, G.S., Chemical composition and screening of the antimicrobial and antioxidative acrivity of extracts of Stachys species, J. Serb. Chem. Soc., 2010, 75, 10, 1347-1359, https://doi.org/10.2298/JSC100601117L . [all data]

Radulovic, Dordevic, et al., 2010
Radulovic, N.S.; Dordevic, N.D.; Palic, R.M., Volatiles of Pleurospermum austriacum (L.) Hoffm. (Apiaceae), J. Serbian Chem. Soc., 2010, 75, 12, 1-11, https://doi.org/10.2298/JSC100323127R . [all data]

Vedernikov and Roschin, 2010
Vedernikov, D.N.; Roschin, V.I., Extractive compounds of Birch Buds (Betula pendula Roth.): I. Composition of fatty acids, hydrocarbons , and esters, Rus. J. Bioorg. Chem., 2010, 36, 7, 894-898, https://doi.org/10.1134/S1068162010070174 . [all data]

Xu, Han, et al., 2009
Xu, L.-L.; Han, T.; Wu, J.-Z.; Zhang, Q.-Y.; Zhang, H.; Huang, B.-K.; Rahman, K., Comparative research of chemical constituents, antifungal and antitumor properties of ether extracts of Panax ginseng and its endophytic fungus, Phytomedicine: Int. J. Phytotherapy Phytopharmacology, 2009, 16, 6-7, 609-616, https://doi.org/10.1016/j.phymed.2009.03.014 . [all data]

Pandey-Rai S., Mallavarapu G.R., et al., 2006
Pandey-Rai S.; Mallavarapu G.R.; Naqvi A.A.; Yadav A.; Rai S.K.; Srivastava S.; Singh D.; Mishra R.; Kumar S., Volatile components of leaves and flowers of periwinkle Catharanthus roseus (L.) G. Don from New Delhi, Flavour Fragr. J., 2006, 21, 3, 427-430, https://doi.org/10.1002/ffj.1606 . [all data]

Okumura, 1991
Okumura, T., retention indices of environmental chemicals on methyl silicone capillary column, Journal of Environmental Chemistry (Japan), 1991, 1, 2, 333-358, https://doi.org/10.5985/jec.1.333 . [all data]

Yaacob, Abdullah, et al., 1989
Yaacob, K.B.; Abdullah, C.M.; Joulain, D., Essential Oil of Ruta graveolens L., J. Essent. Oil Res., 1989, 1, 5, 203-207, https://doi.org/10.1080/10412905.1989.9697787 . [all data]

Bestmann, Classen, et al., 1988
Bestmann, H.-J.; Classen, B.; Kobold, U.; Vostrowsky, O.; Klingauf, F.; Stein, U., Steam volatile constituents from leaves of Rhus typhina, Phytochemistry, 1988, 27, 1, 85-90, https://doi.org/10.1016/0031-9422(88)80595-8 . [all data]

Miyazawa, Maehara, et al., 2002
Miyazawa, M.; Maehara, T.; Kurose, K., Composition of the essential oil from the leaves of Eruca sativa, Flavour Fragr. J., 2002, 17, 3, 187-190, https://doi.org/10.1002/ffj.1079 . [all data]

Chen, Keeran, et al., 2002
Chen, P.H.; Keeran, W.S.; Van Ausdale, W.A.; Schindler, D.R.; Roberts, D.W., Application of Lee retention indices to the confirmation of tentatively identified compounds from GC/MS analysis of environmental samples, Technical paper, Analytical Services Division, Environmental ScienceEngineering, Inc, PO Box 1703, Gainesville, FL 32602, 2002, 11. [all data]