Pentanoic acid, 2-methyl-, butyl ester

Kovats' RI, non-polar column, isothermal

View large format table.

Column type Active phase Temperature (C) I Reference Comment
PackedSE-30150.1097.Ashes and Haken, 1974Celaton (62-72 mesh); Column length: 3.7 m

Kovats' RI, non-polar column, custom temperature program

View large format table.

Column type Active phase I Reference Comment
CapillarySE-301097.Chretien and Dubois, 1978Program: not specified

Normal alkane RI, non-polar column, custom temperature program

View large format table.

Column type Active phase I Reference Comment
CapillarySE-301097.Liu, Liang, et al., 2007Program: not specified

Normal alkane RI, polar column, temperature ramp

View large format table.

Column type Active phase I Reference Comment
CapillarySupelcowax-101313.Ha and Lindsay, 198960. m/0.32 mm/0.25 μm, He, 50. C @ 15. min, 2. K/min; Tend: 230. C

References

Ashes and Haken, 1974
Ashes, J.R.; Haken, J.K., Gas chromatography of homologous esters. VI. Structure-retention increments of aliphatic esters, J. Chromatogr., 1974, 101, 1, 103-123, https://doi.org/10.1016/S0021-9673(01)94737-5 . [all data]

Chretien and Dubois, 1978
Chretien, J.R.; Dubois, J-E., Topological Analysis: A Technique for the Physico-Chemical Exploitation of Retention Data in Gas-Liquid Chromatography, J. Chromatogr., 1978, 158, 43-56, https://doi.org/10.1016/S0021-9673(00)89954-9 . [all data]

Liu, Liang, et al., 2007
Liu, F.; Liang, Y.; Cao, C.; Zhou, N., QSPR study of GC retention indices for saturated esters on seven stationary phases based on novel topological indices, Talanta, 2007, 72, 4, 1307-1315, https://doi.org/10.1016/j.talanta.2007.01.038 . [all data]

Ha and Lindsay, 1989
Ha, J.K.; Lindsay, R.C., Mass spectra of butyl esters of volatile branched-chain and other fatty acids occurring in milkfat and meat lipids, J. Food Comp. Anal., 1989, 2, 2, 118-131, https://doi.org/10.1016/0889-1575(89)90072-0 . [all data]