Hexane, 1,6-dibromo-

Kovats' RI, non-polar column, isothermal

View large format table.

Column type Active phase Temperature (C) I Reference Comment
CapillarySE-54120.1312.Grigor'eva, Vasil'ev, et al., 199315. m/0.28 mm/2.4 μm, Ar
CapillarySE-54160.1333.Grigor'eva, Vasil'ev, et al., 199315. m/0.28 mm/2.4 μm, Ar
PackedSE-30175.1299.Casteignau and Villessot, 1968Column length: 3. m

Kovats' RI, polar column, isothermal

View large format table.

Column type Active phase Temperature (C) I Reference Comment
CapillaryPEG-40M120.1764.Grigor'eva, Vasil'ev, et al., 199340. m/0.25 mm/0.10 μm, Ar
CapillaryPEG-40M120.1807.Grigor'eva, Vasil'ev, et al., 199340. m/0.25 mm/0.10 μm, Ar
PackedCarbowax 20M175.1763.Casteignau and Villessot, 1968Column length: 3. m

Normal alkane RI, non-polar column, isothermal

View large format table.

Column type Active phase Temperature (C) I Reference Comment
CapillaryApiezon L130.1310.Arruda, Junkes, et al., 2008

References

Grigor'eva, Vasil'ev, et al., 1993
Grigor'eva, D.N.; Vasil'ev, A.V.; Golovnya, R.V., Effect of the temperature on the retention indices in homologous series of bifunctional compounds under capillary gas chromatography conditions, J. Anal. Chem. USSR (Engl. Transl.), 1993, 48, 7, 817-822. [all data]

Casteignau and Villessot, 1968
Casteignau, G.; Villessot, D., Identification par chromatographie en phase gaseuse de composés difonctionnels insaturés. I. Synthèse et indices de rétention, Bull. Soc. Chim. Fr., 1968, 9, 3893-3903. [all data]

Arruda, Junkes, et al., 2008
Arruda, A.C.S.; Junkes, B. da.S.; Souza, E.S.; Yunes, R.A.; Heizen, V.E.F., Semi-Emlirical Topological Index to Predict Properties of Halogenated Aliphatic Compounds, J. Chemometrics, 2008, 22, 3-4, 186-194, https://doi.org/10.1002/cem.1121 . [all data]