p-t-amyl-nitrobenzene radical

Gas phase ion energetics data

Data compiled by: John E. Bartmess

Electron affinity determinations

EA (eV) Method Reference Comment
2.17 ± 0.17CIDCBurinsky, Fukuda, et al., 1984

References

Burinsky, Fukuda, et al., 1984
Burinsky, D.J.; Fukuda, E.K.; Campana, J.E., Electron affinities from dissociations of mixed negative ion dimers, J. Am. Chem. Soc., 1984, 106, 2270. [all data]