5-methylhexanoic acid

Phase change data

Data compiled by: Thermodynamics Research Center, NIST Boulder Laboratories, Chris Muzny director

Quantity Value Units Method Reference Comment
Tboil486.KN/ASisido, Kazama, et al., 1959Uncertainty assigned by TRC = 6. K

In addition to the Thermodynamics Research Center (TRC) data available from this site, much more physical and chemical property data is available from the following TRC products:

References

Sisido, Kazama, et al., 1959
Sisido, K.; Kazama, Y.; Kodama, H.; Nozaki, H., J. Am. Chem. Soc., 1959, 81, 5817. [all data]