Triethyl methanetricarboxylate

Phase change data

Data compiled as indicated in comments:
BS - Robert L. Brown and Stephen E. Stein
ALS - Hussein Y. Afeefy, Joel F. Liebman, and Stephen E. Stein
DRB - Donald R. Burgess, Jr.
AC - William E. Acree, Jr., James S. Chickos

Quantity Value Units Method Reference Comment
Tboil526.2KN/AWeast and Grasselli, 1989BS
Quantity Value Units Method Reference Comment
Δvap79.20 ± 0.71kJ/molVVerevkin, Beckhaus, et al., 1992ALS
Δvap79.2kJ/molN/AVerevkin, Beckhaus, et al., 1992DRB
Δvap79.1 ± 0.7kJ/molGSVerevkin, Beckhaus, et al., 1992Based on data from 297. - 338. K.; AC

Enthalpy of vaporization

ΔvapH (kJ/mol) Temperature (K) Method Reference Comment
74.1 ± 0.4298. - 338.GSRakus, Verevkin, et al., 1995AC

Gas phase thermochemistry data

Data compiled by: Hussein Y. Afeefy, Joel F. Liebman, and Stephen E. Stein

Quantity Value Units Method Reference Comment
Δfgas-280.37 ± 0.30kcal/molCcbVerevkin, Beckhaus, et al., 1992

References

Weast and Grasselli, 1989
CRC Handbook of Data on Organic Compounds, 2nd Editon, Weast,R.C and Grasselli, J.G., ed(s)., CRC Press, Inc., Boca Raton, FL, 1989, 1. [all data]

Verevkin, Beckhaus, et al., 1992
Verevkin, S.P.; Beckhaus, H.-D.; Ruchardt, C., Geminale substituenteneffekte Teil 5α. Standardbildungsenthalpien von alkylsubstituierten Malonsaure- und α-aminocarbonsaureestern, Thermochim. Acta, 1992, 197, 27-39. [all data]

Rakus, Verevkin, et al., 1995
Rakus, K.; Verevkin, S.P.; Keller, M.; Beckhaus, H.-D.; Ruchardt, C., Radical stabilization enthalpies of α,α-bis(methoxycarbonyl)alkyl and tris(methoxycarbonyl)methyl radicals, Liebigs Ann. Chem., 1995, 1483-1493. [all data]