Piperidine, 1-methyl-

Phase change data

Data compiled as indicated in comments:
BS - Robert L. Brown and Stephen E. Stein
TRC - Thermodynamics Research Center, NIST Boulder Laboratories, Chris Muzny director
AC - William E. Acree, Jr., James S. Chickos

Quantity Value Units Method Reference Comment
Tboil380.2KN/AWeast and Grasselli, 1989BS
Tboil378.85KN/ALanum and Morris, 1969Uncertainty assigned by TRC = 0.2 K; TRC
Tboil379.05KN/AMagnusson and Schierz, 1940Uncertainty assigned by TRC = 0.5 K; TRC
Tboil379.65KN/ARau and Narayanaswamy, 1934Uncertainty assigned by TRC = 0.5 K; TRC
Tboil390.15KN/ALoffler, 1910Uncertainty assigned by TRC = 3. K; TRC
Quantity Value Units Method Reference Comment
Δvap36.8 ± 0.6kJ/molCRibeiro da Silva, Cabral, et al., 2006AC
Δvap36.8 ± 0.6kJ/molCRibeiro da Silva, Cabral, et al., 2006AC
Δvap36.7 ± 0.1kJ/molN/ABerthon, Angot, et al., 1979See also Ewing and Sanchez Ochoa, 1998.; AC

Enthalpy of vaporization

ΔvapH (kJ/mol) Temperature (K) Method Reference Comment
36.5313.N/ABelaribi, Ait-Kaci, et al., 1995Based on data from 298. - 343. K.; AC
37.3288.AStephenson and Malanowski, 1987Based on data from 273. - 380. K.; AC

In addition to the Thermodynamics Research Center (TRC) data available from this site, much more physical and chemical property data is available from the following TRC products:

Condensed phase thermochemistry data

Data compiled by: Eugene S. Domalski and Elizabeth D. Hearing

Constant pressure heat capacity of liquid

Cp,liquid (J/mol*K) Temperature (K) Reference
184.9298.Conti, Gianni, et al., 1976

Gas phase ion energetics data

Data evaluated as indicated in comments:
HL - Edward P. Hunter and Sharon G. Lias

Data compiled as indicated in comments:
LBLHLM - Sharon G. Lias, John E. Bartmess, Joel F. Liebman, John L. Holmes, Rhoda D. Levin, and W. Gary Mallard
LLK - Sharon G. Lias, Rhoda D. Levin, and Sherif A. Kafafi

Quantity Value Units Method Reference Comment
Proton affinity (review)232.1kcal/molN/AHunter and Lias, 1998HL
Quantity Value Units Method Reference Comment
Gas basicity224.7kcal/molN/AHunter and Lias, 1998HL

Ionization energy determinations

IE (eV) Method Reference Comment
7.80 ± 0.05PERozeboom and Houk, 1982LBLHLM
7.74 ± 0.05PEPesterev, Gabdrakipov, et al., 1979LLK
8.35PESpanka and Rademacher, 1986Vertical value; LBLHLM
8.29PESarneel, Worrell, et al., 1980Vertical value; LLK
8.29 ± 0.02PEAue, Webb, et al., 1976Vertical value; LLK
8.29 ± 0.05PEMorishima, Yoshikawa, et al., 1975Vertical value; LLK
8.29 ± 0.02PEYoshikawa, Hashimoto, et al., 1974Vertical value; LLK

Kovats' RI, non-polar column, isothermal

Data compiled by: NIST Mass Spectrometry Data Center, William E. Wallace, director

Column type CapillaryCapillaryPackedPackedPacked
Active phase OV-101OV-101Apiezon LPMS-100PMS-100
Column length (m) 50.50.2.73.3.
Carrier gas HeHeN2 or HeHeHe
Substrate   Chromosorb G, AWCelite 545 (44-60 mesh)Celite 545 (44-60 mesh)
Column diameter (mm) 0.30.30
Phase thickness (μm) 0.40.40
Temperature (C) 110.110.100.130.150.
I 766.769.779.750.760.
ReferenceZhuravleva, 2000Zhuravleva, Golovnya, et al., 1993Zhuravleva, Kapustin, et al., 1976Anderson, Jurel, et al., 1973Anderson, Jurel, et al., 1973
Comment MSDC-RI MSDC-RI MSDC-RI MSDC-RI MSDC-RI
Column type Packed
Active phase PMS-100
Column length (m) 3.
Carrier gas He
Substrate Celite 545 (44-60 mesh)
Column diameter (mm)
Phase thickness (μm)
Temperature (C) 180.
I 763.
ReferenceAnderson, Jurel, et al., 1973
Comment MSDC-RI

References

Weast and Grasselli, 1989
CRC Handbook of Data on Organic Compounds, 2nd Editon, Weast,R.C and Grasselli, J.G., ed(s)., CRC Press, Inc., Boca Raton, FL, 1989, 1. [all data]

Lanum and Morris, 1969
Lanum, W.J.; Morris, J.C., Physical Properties of Some Sulfur and Nitrogen Compounds, J. Chem. Eng. Data, 1969, 14, 93-8. [all data]

Magnusson and Schierz, 1940
Magnusson, H.W.; Schierz, E.R., A Study of SOme Physical Constants of N-n-Alkylpiperidines, Univ. Wyo. Publ., 1940, 7, 1. [all data]

Rau and Narayanaswamy, 1934
Rau, M.A.G.; Narayanaswamy, B.N., The determination of dipole moments using the method of diluted solutions: I and II, Z. Phys. Chem., Abt. B, 1934, 26, 23. [all data]

Loffler, 1910
Loffler, K., A New Synthesis of N-Alkyl Pyrrolidines, Chem. Ber., 1910, 43, 2035. [all data]

Ribeiro da Silva, Cabral, et al., 2006
Ribeiro da Silva, Manuel A.V.; Cabral, Joana I.T.A.; Gomes, Paula; Gomes, José R.B., Combined Experimental and Computational Study of the Thermochemistry of Methylpiperidines, J. Org. Chem., 2006, 71, 10, 3677-3685, https://doi.org/10.1021/jo052468w . [all data]

Berthon, Angot, et al., 1979
Berthon, Guy; Angot, Bernard; Beden, Bernard; Enea, Octavian, Quantitative comparison of substituent effects on solvation and proton-ionization standard enthalpies of methylpiperidines, The Journal of Chemical Thermodynamics, 1979, 11, 6, 539-546, https://doi.org/10.1016/0021-9614(79)90092-2 . [all data]

Ewing and Sanchez Ochoa, 1998
Ewing, M.B.; Sanchez Ochoa, J.C., An ebulliometer for measurements of vapour pressure at low temperatures: the vapour pressures and the critical state of perfluoromethylcyclopentane, The Journal of Chemical Thermodynamics, 1998, 30, 2, 189-198, https://doi.org/10.1006/jcht.1997.0290 . [all data]

Belaribi, Ait-Kaci, et al., 1995
Belaribi, F.B.; Ait-Kaci, A.; Jose, J., Equilibres liquide-vapeur isothermes de melanges binaires de la piperidine et de la N-methyl piperidine avec certains ethers, Journal of Thermal Analysis, 1995, 44, 5, 1177-1194, https://doi.org/10.1007/BF02547548 . [all data]

Stephenson and Malanowski, 1987
Stephenson, Richard M.; Malanowski, Stanislaw, Handbook of the Thermodynamics of Organic Compounds, 1987, https://doi.org/10.1007/978-94-009-3173-2 . [all data]