Propane, 2-ethoxy-

Phase change data

Data compiled as indicated in comments:
BS - Robert L. Brown and Stephen E. Stein
TRC - Thermodynamics Research Center, NIST Boulder Laboratories, Chris Muzny director
ALS - Hussein Y. Afeefy, Joel F. Liebman, and Stephen E. Stein
AC - William E. Acree, Jr., James S. Chickos

Quantity Value Units Method Reference Comment
Tboil326. - 327.KN/AFrinton Laboratories Inc., 1986BS
Tboil327.2KN/AMajer and Svoboda, 1985
Tboil366.9KN/AMikhant'ev and Mikhant'ev, 1964Uncertainty assigned by TRC = 2. K; TRC
Quantity Value Units Method Reference Comment
Tc490.3KN/AMajer and Svoboda, 1985
Quantity Value Units Method Reference Comment
Δvap30.32kJ/molN/AMajer and Svoboda, 1985
Δvap30.04kJ/molCMajer, Wagner, et al., 1980ALS
Δvap30.0kJ/molCMajer, Wagner, et al., 1980AC

Enthalpy of vaporization

ΔvapH (kJ/mol) Temperature (K) Reference Comment
28.21327.2Majer and Svoboda, 1985

Enthalpy of vaporization

ΔvapH = A exp(-βTr) (1 − Tr)β
    ΔvapH = Enthalpy of vaporization (at saturation pressure) (kJ/mol)
    Tr = reduced temperature (T / Tc)

View plot Requires a JavaScript / HTML 5 canvas capable browser.

Temperature (K) A (kJ/mol) β Tc (K) Reference Comment
298. - 343.46.930.288490.3Majer and Svoboda, 1985

In addition to the Thermodynamics Research Center (TRC) data available from this site, much more physical and chemical property data is available from the following TRC products:

References

Frinton Laboratories Inc., 1986
Frinton Laboratories Inc., Catalog Number 11, Frinton Laboratories Inc., Vineland, NJ, 1986, 99. [all data]

Majer and Svoboda, 1985
Majer, V.; Svoboda, V., Enthalpies of Vaporization of Organic Compounds: A Critical Review and Data Compilation, Blackwell Scientific Publications, Oxford, 1985, 300. [all data]

Mikhant'ev and Mikhant'ev, 1964
Mikhant'ev, B.I.; Mikhant'ev, V.B., Hydrogenation of Simple Vinyl Ethers, Tr. Probl. Lab. Khim. Vysokomol. Soedin., Voronezh. Gos. Univ., 1964, No. 3, 20-5. [all data]

Majer, Wagner, et al., 1980
Majer, V.; Wagner, Z.; Svoboda, V.; Cadek, V., Enthalpies of vaporization and cohesive energies for a group of aliphatic ethers, J. Chem. Thermodyn., 1980, 12, 387-391. [all data]