3-Hexanol, 5-methyl-

Phase change data

Data compiled as indicated in comments:
TRC - Thermodynamics Research Center, NIST Boulder Laboratories, Chris Muzny director
AC - William E. Acree, Jr., James S. Chickos

Quantity Value Units Method Reference Comment
Tboil420.15KN/ABenkeser, Hazdra, et al., 1959Uncertainty assigned by TRC = 3. K; TRC
Quantity Value Units Method Reference Comment
Δvap59.8 ± 0.3kJ/molGSRoganov, Pisarev, et al., 2005Based on data from 275. - 311. K.; AC

In addition to the Thermodynamics Research Center (TRC) data available from this site, much more physical and chemical property data is available from the following TRC products:

References

Benkeser, Hazdra, et al., 1959
Benkeser, R.A.; Hazdra, J.J.; Burrous, M.L., Factors influencing the direction of elimination in ester pyrolyses, J. Am. Chem. Soc., 1959, 81, 5374. [all data]

Roganov, Pisarev, et al., 2005
Roganov, Gennady N.; Pisarev, Pavel N.; Emel'yanenko, Vladimir N.; Verevkin, Sergey P., Measurement and Prediction of Thermochemical Properties. Improved Benson-Type Increments for the Estimation of Enthalpies of Vaporization and Standard Enthalpies of Formation of Aliphatic Alcohols, J. Chem. Eng. Data, 2005, 50, 4, 1114-1124, https://doi.org/10.1021/je049561m . [all data]