Acetic acid, cyclohexyl ester

Gas phase thermochemistry data

Data compiled by: Donald R. Burgess, Jr.

Quantity Value Units Method Reference Comment
Δfgas-507.2 ± 3.0kJ/molN/ASimirskii, Kozyro, et al., 1993Value computed using ΔfHliquid° value of -558.9±3 kj/mol from Simirskii, Kozyro, et al., 1993 and ΔvapH° value of 51.73±0.23 kj/mol from missing citation.

Normal alkane RI, polar column, custom temperature program

Data compiled by: NIST Mass Spectrometry Data Center, William E. Wallace, director

Column type Capillary
Active phase Carbowax 20M
Column length (m)
Carrier gas
Substrate
Column diameter (mm)
Phase thickness (μm)
Program not specified
I 1343.
ReferenceVinogradov, 2004
Comment MSDC-RI

References

Simirskii, Kozyro, et al., 1993
Simirskii, V.V.; Kozyro, A.A.; Kabo, G.Ya.; Yursha, I.A.; Marachuk, L.I., Thermodynamic properties and saponification kinetics of cyclohexyl acetate, J. Appl. Chem. USSR, 1993, 65, 1348-1353, In original 1638. [all data]