Butyric acid, tetradecyl ester

Phase change data

Data compiled by: Thermodynamics Research Center, NIST Boulder Laboratories, Chris Muzny director

Quantity Value Units Method Reference Comment
Tfus271.15KN/APaquot, Sorba, et al., 1955Uncertainty assigned by TRC = 4. K

In addition to the Thermodynamics Research Center (TRC) data available from this site, much more physical and chemical property data is available from the following TRC products:

References

Paquot, Sorba, et al., 1955
Paquot, C.; Sorba, Mme.J.; Wieme, N., The Phys. Prop. of Aliphatic Esters Containing Eighteen Carbon Atoms, Ind. Chim. Belge., 1955, 20, Spec. No. 727. [all data]