Dicyclohexyl oxalate

Phase change data

Data compiled by: William E. Acree, Jr., James S. Chickos

Quantity Value Units Method Reference Comment
Δvap92.1 ± 0.7kJ/molGSLipp, Krasnykh, et al., 2008Based on data from 333. - 360. K.

References

Lipp, Krasnykh, et al., 2008
Lipp, S.V.; Krasnykh, E.L.; Levanova, S.V., Saturated vapor pressures and the enthalpies of vaporization of dicyclohexyl esters of dicarboxylic acids, Russ. J. Phys. Chem. A, 2008, 82, 12, 2025-2029, https://doi.org/10.1134/S0036024408120091 . [all data]