Phenol, 2,3,6-trichloro-, acetate

Kovats' RI, non-polar column, isothermal

View large format table.

Column type Active phase Temperature (C) I Reference Comment
CapillarySE-30160.1463.Evans and Haken, 1989Column length: 25. m; Column diameter: 0.32 mm
CapillaryOV-101160.1463.Haken and Korhonen, 1983N2; Column length: 25. m; Column diameter: 0.22 mm
CapillaryOV-101180.1495.Haken and Korhonen, 1983N2; Column length: 25. m; Column diameter: 0.22 mm

Kovats' RI, polar column, isothermal

View large format table.

Column type Active phase Temperature (C) I Reference Comment
CapillaryOV-351160.2139.Evans and Haken, 1989Column length: 25. m; Column diameter: 0.32 mm

References

Evans and Haken, 1989
Evans, M.B.; Haken, J.K., Dispersion and selectivity indices in gas chromatography. IV. Chlorinated aromatic compounds, J. Chromatogr., 1989, 468, 373-382, https://doi.org/10.1016/S0021-9673(00)96332-5 . [all data]

Haken and Korhonen, 1983
Haken, J.K.; Korhonen, I.O.O., Gas chromatography of homologous esters. XXI. Capillary column studies of the chlorinated phenyl acetates, J. Chromatogr., 1983, 257, 267-273, https://doi.org/10.1016/S0021-9673(01)88182-6 . [all data]