Benzene, (1-chloroethenyl)-

Phase change data

Data compiled by: Thermodynamics Research Center, NIST Boulder Laboratories, Chris Muzny director

Quantity Value Units Method Reference Comment
Tfus325.KN/AGross and Gloede, 1963Uncertainty assigned by TRC = 5. K

In addition to the Thermodynamics Research Center (TRC) data available from this site, much more physical and chemical property data is available from the following TRC products:

References

Gross and Gloede, 1963
Gross, H.; Gloede, J., Chem. Ber., 1963, 96, 1387-94. [all data]