N-1H-Tetrazol-5-ylacetamide

Condensed phase thermochemistry data

Data compiled by: Hussein Y. Afeefy, Joel F. Liebman, and Stephen E. Stein

Quantity Value Units Method Reference Comment
Δfsolid-7.57kJ/molCcbMcEwan and Rigg, 1951
Quantity Value Units Method Reference Comment
Δcsolid-1887.5 ± 1.8kJ/molCcbMcEwan and Rigg, 1951Reanalyzed by Cox and Pilcher, 1970, Original value = -1890.1 ± 1.8 kJ/mol

References

McEwan and Rigg, 1951
McEwan, W.S.; Rigg, M.W., The heats of combustion of compounds containing the tetrazole ring, J. Am. Chem. Soc., 1951, 73, 4725-4727. [all data]

Cox and Pilcher, 1970
Cox, J.D.; Pilcher, G., Thermochemistry of Organic and Organometallic Compounds, Academic Press, New York, 1970, 1-636. [all data]