Uracil, 1-methyl-

Phase change data

Data compiled by: William E. Acree, Jr., James S. Chickos

Enthalpy of sublimation

ΔsubH (kJ/mol) Temperature (K) Method Reference Comment
121.7 ± 4.0439.TEBrunetti, Piacente, et al., 2000Based on data from 343. - 428. K.
112.5 ± 2.6398.QRTeplitsky, Yanson, et al., 1980Based on data from 378. - 418. K.
105. ± 8.457.HSANowak, Szczepaniak, et al., 1978Based on data from 435. - 480. K.

References

Brunetti, Piacente, et al., 2000
Brunetti, Bruno; Piacente, Vincenzo; Portalone, Gustavo, Sublimation Enthalpies of Some Methyl Derivatives of Uracil from Vapor Pressure Measurements, J. Chem. Eng. Data, 2000, 45, 2, 242-246, https://doi.org/10.1021/je9902802 . [all data]

Teplitsky, Yanson, et al., 1980
Teplitsky, A.B.; Yanson, I.K.; Glukhova, O.T.; Zielenkiwicz, A.; Zielenkiewicz, W.; Wierzchowski, K.L., Thermochemistry of aqueous solutions of alkylated nucleic acid bases, Biophysical Chemistry, 1980, 11, 1, 17-21, https://doi.org/10.1016/0301-4622(80)85003-4 . [all data]

Nowak, Szczepaniak, et al., 1978
Nowak, M.J.; Szczepaniak, K.; Barski, A.; Shugar, D.Z., Z. Naturforsch. C, 1978, 33C, 876. [all data]