Quinoline, 2-phenyl-

Lee's RI, non-polar column, temperature ramp

View large format table.

Column type Active phase I Reference Comment
CapillarySE-52339.21Hasegawa, Usami, et al., 19902. K/min; Column length: 12. m; Column diameter: 0.25 mm; Tstart: 50. C; Tend: 270. C

Lee's RI, non-polar column, custom temperature program

View large format table.

Column type Active phase I Reference Comment
CapillaryHP-5335.06Reckendorf, 199725. m/0.2 mm/0.11 μm, He; Program: 106C(0.2min) => 40C/min => 120C => 3C/min => 310C(10min)
CapillarySE-52339.64Hasegawa, Usami, et al., 1990Column length: 12. m; Column diameter: 0.25 mm; Program: not specified

Gas phase ion energetics data

Data compiled by: Sharon G. Lias, Rhoda D. Levin, and Sherif A. Kafafi

Ionization energy determinations

IE (eV) Method Reference
8.10PESchafer, Schweig, et al., 1973

References

Hasegawa, Usami, et al., 1990
Hasegawa, K.; Usami, S.; Higashide, A., Analysis of amino polycyclic aromatic hydrocarbons and polycyclic aromatic nitrogen heterocycles, Nippon Kagaku Kaishi, 1990, 7, 777-788, https://doi.org/10.1246/nikkashi.1990.777 . [all data]

Reckendorf, 1997
Reckendorf, R.M., Identification of phenyl-substituted polycyclic aromatic compounds in ring furnace gases using GC-MS and GC-AED, Chromatographia, 1997, 45, 1, 173-182, https://doi.org/10.1007/BF02505557 . [all data]