[1,1'-Biphenyl]-3,3'-diol

Kovats' RI, non-polar column, isothermal

View large format table.

Column type Active phase Temperature (C) I Reference Comment
PackedOV-101197.1976.Dufek, Pacáková, et al., 1981N2, Chromaton N Super (0,125-0,16 mm); Column length: 2. m

References

Dufek, Pacáková, et al., 1981
Dufek, P.; Pacáková, V.; Zivný, K., Gas chromatographic behaviour of mono- and dihydroxybiphenyls on various silicone phases, J. Chromatogr., 1981, 211, 1, 150-154, https://doi.org/10.1016/S0021-9673(00)81184-X . [all data]