5-Quinolinamine

Phase change data

Data compiled as indicated in comments:
BS - Robert L. Brown and Stephen E. Stein
TRC - Thermodynamics Research Center, NIST Boulder Laboratories, Chris Muzny director
ALS - Hussein Y. Afeefy, Joel F. Liebman, and Stephen E. Stein
DRB - Donald R. Burgess, Jr.
AC - William E. Acree, Jr., James S. Chickos

Quantity Value Units Method Reference Comment
Tboil583.2KN/AAldrich Chemical Company Inc., 1990BS
Tboil583.KN/ABuckingham and Donaghy, 1982BS
Quantity Value Units Method Reference Comment
Tfus383.KN/ABuckingham and Donaghy, 1982BS
Tfus381.15KN/ACumper, Ginman, et al., 1963Uncertainty assigned by TRC = 1. K; TRC
Tfus379.KN/ABradford, Elliott, et al., 1947Uncertainty assigned by TRC = 0.003 K; TRC
Quantity Value Units Method Reference Comment
Δsub105.0 ± 0.7kJ/molCRibeiro da Silva, Matos, et al., 1993ALS
Δsub105.0kJ/molN/ARibeiro da Silva, Matos, et al., 1993DRB
Δsub105.0 ± 0.7kJ/molMEda Silva, Matos, et al., 1993Based on data from 329. - 349. K.; AC
Δsub103.3 ± 3.4kJ/molCda Silva, Matos, et al., 1993AC

Reduced pressure boiling point

Tboil (K) Pressure (bar) Reference Comment
457.0.013Buckingham and Donaghy, 1982BS

Enthalpy of sublimation

ΔsubH (kJ/mol) Temperature (K) Method Reference Comment
102.9 ± 0.7339.MEda Silva, Matos, et al., 1993Based on data from 329. - 349. K.; AC

In addition to the Thermodynamics Research Center (TRC) data available from this site, much more physical and chemical property data is available from the following TRC products:

References

Aldrich Chemical Company Inc., 1990
Aldrich Chemical Company Inc., Catalog Handbook of Fine Chemicals, Aldrich Chemical Company, Inc., Milwaukee WI, 1990, 1. [all data]

Buckingham and Donaghy, 1982
Buckingham, J.; Donaghy, S.M., Dictionary of Organic Compounds: Fifth Edition, Chapman and Hall, New York, 1982, 1. [all data]

Cumper, Ginman, et al., 1963
Cumper, C.W.N.; Ginman, R.F.A.; Redford, D.G.; Vogel, A.I., Physical Properties and Chemical Constitution. Part XXXVIII. The Electric Dipole Moments of Aminopyridines and Aminoquinolines., J. Chem. Soc., 1963, 1963, 1731. [all data]

Bradford, Elliott, et al., 1947
Bradford, L.; Elliott, T.J.; Rowe, F.M., Skraup reaction with meta substituted anilines., J. Chem. Soc., 1947, 437-45. [all data]

Ribeiro da Silva, Matos, et al., 1993
Ribeiro da Silva, M.A.V.; Matos, M.A.R.; Monte, M.J.S.; Alves, M.C.B.; Vieira, J.M.A.P., Enthalpies of combustion, vapour pressures, and enthalpies of sublimation of 3-,5-,6-, and 8-aminoquinoline, J. Chem. Thermodyn., 1993, 25, 579-590. [all data]

da Silva, Matos, et al., 1993
da Silva, Manuel A.V. Ribeiro; Matos, M. Agostinha R.; Monte, Manuel J.S.; Alves, M. Céu B.; Vieira, João M.A.P., Enthalpies of combustion, vapour pressures, and enthalpies of sublimation of 3-, 5-, 6-, and 8-aminoquinoline, The Journal of Chemical Thermodynamics, 1993, 25, 5, 579-590, https://doi.org/10.1006/jcht.1993.1052 . [all data]