Benzene, 1-methyl-2-nitroso-

Reaction thermochemistry data

Data compiled by: Hussein Y. Afeefy, Joel F. Liebman, and Stephen E. Stein

Individual Reactions

cis o,o'-Azodioxytoluene = 2Benzene, 1-methyl-2-nitroso-

By formula: C14H14N2O2 = 2C7H7NO

Quantity Value Units Method Reference Comment
Δr58.5 ± 2.5kJ/molEqkAzoulay and Wettermark, 1978liquid phase; solvent: Acetonitrile
Δr45.6 ± 2.1kJ/molEqkAzoulay and Wettermark, 1978liquid phase; solvent: Acetonitrile

References

Azoulay and Wettermark, 1978
Azoulay, M.; Wettermark, G., Kinetics of the dissociation and cis-trans isomerization of o,o'-azodioxytoluene (dimeric o-nitrosotoluene), Tetrahedron, 1978, 34, 2591-2596. [all data]