Anisole, 3,5-dimethyl-4-nitro-

Gas phase ion energetics data

Data compiled by: John E. Bartmess

Electron affinity determinations

EA (eV) Method Reference Comment
0.66 ± 0.10IMREMishima, Kang, et al., 1993ΔGea(343 K) = -14.6 kcal/mol; ΔSea (est) = -2.0 eu.
0.50 ± 0.10CIDCChen, Cooks, et al., 1996

References

Mishima, Kang, et al., 1993
Mishima, M.; Kang, C.H.; Huh, C.; Fujio, M.; Tsuno, Y., Substituent Effect on Electron Affinity of 2,6-Dimethylnitrobenzene, Chem. Lett., 1993, 22, 5, 889, https://doi.org/10.1246/cl.1993.889 . [all data]

Chen, Cooks, et al., 1996
Chen, G.; Cooks, R.G.; Corpuz, E.; Scott, L.T., Estimation of the Electron Affinities of C60, Corannulene, and Coronene by Using the Kinetic Method, J. Am. Soc. Mass Spectrom., 1996, 7, 7, 619, https://doi.org/10.1016/1044-0305(96)85610-8 . [all data]