Bicyclo[4.4.1]undeca-1,3,5,8-tetralene

Condensed phase thermochemistry data

Data compiled by: Hussein Y. Afeefy, Joel F. Liebman, and Stephen E. Stein

Quantity Value Units Method Reference Comment
Δcliquid-6230. ± 30.kJ/molCcbStevenson and Zigler, 1983Corresponding Δfliquid = 190. kJ/mol (simple calculation by NIST; no Washburn corrections)

References

Stevenson and Zigler, 1983
Stevenson, G.R.; Zigler, S.S., Relative thermodynamic stabilities of 1,6-methano[10]annulene, dinorcaradiene, and the 1,6-methano[10]annulene anion radical, J. Phys. Chem., 1983, 87, 895-898. [all data]