Creatinine

Condensed phase thermochemistry data

Data compiled as indicated in comments:
ALS - Hussein Y. Afeefy, Joel F. Liebman, and Stephen E. Stein
DH - Eugene S. Domalski and Elizabeth D. Hearing

Quantity Value Units Method Reference Comment
Δfsolid-239.93 ± 0.88kJ/molCcrJohnson, 1975ALS
Δfsolid-238.5 ± 0.50kJ/molCcbHuffman, Ellis, et al., 1936Reanalyzed by Cox and Pilcher, 1970, Original value = -242.4 kJ/mol; ALS
Quantity Value Units Method Reference Comment
Δcsolid-2334.53 ± 0.86kJ/molCcrJohnson, 1975ALS
Δcsolid-2336.0 ± 0.42kJ/molCcbHuffman, Ellis, et al., 1936Reanalyzed by Cox and Pilcher, 1970, Original value = -2335.1 ± 0.67 kJ/mol; ALS
Δcsolid-2359.8kJ/molCcbEmery and Benedict, 1911ALS
Quantity Value Units Method Reference Comment
solid,1 bar167.4J/mol*KN/AHuffman and Borsook, 1932Extrapolation below 90 K, 55.98 J/mol*K.; DH

Constant pressure heat capacity of solid

Cp,solid (J/mol*K) Temperature (K) Reference Comment
138.1296.5Huffman and Borsook, 1932T = 87 to 297 K. Value is unsmoothed experimental datum.; DH

References

Johnson, 1975
Johnson, W.H., The enthalpies of combustion and formation of nicotinic acid and creatinine, J. Res. NBS, 1975, 79, 425-429. [all data]

Huffman, Ellis, et al., 1936
Huffman, H.M.; Ellis, E.L.; Fox, S.W., Thermal data. VI. The heats of combustion and free energies of seven organic compounds containing nitrogen, J. Am. Chem. Soc., 1936, 58, 1728-1733. [all data]

Cox and Pilcher, 1970
Cox, J.D.; Pilcher, G., Thermochemistry of Organic and Organometallic Compounds, Academic Press, New York, 1970, 1-636. [all data]

Emery and Benedict, 1911
Emery, A.G.; Benedict, F.G., The heat of combustion of compounds of physiological importance, Am. J. Physiol., 1911, 28, 301-307. [all data]

Huffman and Borsook, 1932
Huffman, H.M.; Borsook, H., Thermal data. I. The heat capacities, entropies and free energies of seven organic compounds containing nitrogen, J. Am. Chem. Soc., 1932, 54, 4297-4301. [all data]