Tributyrin

Phase change data

Data compiled as indicated in comments:
BS - Robert L. Brown and Stephen E. Stein
AC - William E. Acree, Jr., James S. Chickos
ALS - Hussein Y. Afeefy, Joel F. Liebman, and Stephen E. Stein

Quantity Value Units Method Reference Comment
Tboil580.7KN/AWeast and Grasselli, 1989BS
Quantity Value Units Method Reference Comment
Δvap107.07kJ/molN/AMajer and Svoboda, 1985
Δvap84.9 ± 2.5kJ/molTGAKishore, Shobha, et al., 1990AC
Δvap107.1 ± 1.0kJ/molCNilsson and Wadso, 1986ALS
Δvap107.1 ± 1.0kJ/molCNilsson and Wadso, 1986AC

Reduced pressure boiling point

Tboil (K) Pressure (bar) Reference Comment
463.20.020Weast and Grasselli, 1989BS

Enthalpy of vaporization

ΔvapH (kJ/mol) Temperature (K) Method Reference Comment
83.5308.TGAKishore, Shobha, et al., 1990AC
81.4333.AStephenson and Malanowski, 1987Based on data from 318. - 364. K.; AC

Normal alkane RI, non-polar column, isothermal

Data compiled by: NIST Mass Spectrometry Data Center, William E. Wallace, director

Column type CapillaryCapillaryCapillaryCapillary
Active phase OV-101OV-101OV-101OV-101
Column length (m) 30.30.30.30.
Carrier gas HeHeHeHe
Substrate
Column diameter (mm) 0.250.250.250.25
Phase thickness (μm)
Temperature (C) 150.160.170.180.
I 1816.1815.1813.1812.
ReferenceLeol'ko, Krasnykh, et al., 2007Leol'ko, Krasnykh, et al., 2007Leol'ko, Krasnykh, et al., 2007Leol'ko, Krasnykh, et al., 2007
Comment MSDC-RI MSDC-RI MSDC-RI MSDC-RI

Condensed phase thermochemistry data

Data compiled as indicated in comments:
ALS - Hussein Y. Afeefy, Joel F. Liebman, and Stephen E. Stein
DH - Eugene S. Domalski and Elizabeth D. Hearing

Quantity Value Units Method Reference Comment
Δcliquid-1941.3kcal/molCcbKarrer and Fioroni, 1922Corresponding Δfliquid = -357.6 kcal/mol (simple calculation by NIST; no Washburn corrections); ALS

Constant pressure heat capacity of liquid

Cp,liquid (cal/mol*K) Temperature (K) Reference Comment
132.7298.15Nilsson and Wadso, 1986DH
136.313.Phillips and Mattamal, 1976T = 313 to 413 K.; DH

References

Weast and Grasselli, 1989
CRC Handbook of Data on Organic Compounds, 2nd Editon, Weast,R.C and Grasselli, J.G., ed(s)., CRC Press, Inc., Boca Raton, FL, 1989, 1. [all data]

Majer and Svoboda, 1985
Majer, V.; Svoboda, V., Enthalpies of Vaporization of Organic Compounds: A Critical Review and Data Compilation, Blackwell Scientific Publications, Oxford, 1985, 300. [all data]

Kishore, Shobha, et al., 1990
Kishore, K.; Shobha, H.K.; Mattamal, G.J., Structural effects on the vaporization of high molecular weight esters, J. Phys. Chem., 1990, 94, 4, 1642-1648, https://doi.org/10.1021/j100367a077 . [all data]

Nilsson and Wadso, 1986
Nilsson, S.-O.; Wadso, I., Thermodynamic properties of some mono-, di-, and tri esters. Enthalpies of solution in water at 288.15 to 318.15 K and enthalpies of vaporization and heat capacities at 298.15 K, J. Chem. Thermodyn., 1986, 18, 673-681. [all data]

Stephenson and Malanowski, 1987
Stephenson, Richard M.; Malanowski, Stanislaw, Handbook of the Thermodynamics of Organic Compounds, 1987, https://doi.org/10.1007/978-94-009-3173-2 . [all data]